Reaction Details
Target5-hydroxytryptamine receptor 1A
LigandBDBM50065557
Substrate/Competitorn/a
Meas. Tech.ChEMBL_1127 (CHEMBL616072)
Ki 2.67±n/a nM
Citation Yasunaga, TKimura, TNaito, RKontani, TWanibuchi, FYamashita, HNomura, TTsukamoto, SYamaguchi, TMase, T Synthesis and pharmacological characterization of novel 6-fluorochroman derivatives as potential 5-HT1A receptor antagonists. J Med Chem41:2765-78 (1998) 
 
5-hydroxytryptamine receptor 1A
Name:5-hydroxytryptamine receptor 1A
Type:G Protein-Coupled Receptor (GPCR)
Mol. Mass.:46445.29
Organism:Rattus norvegicus (rat)
Description:Binding assays were performed using rat hippocampal membranes.
Residue:422
BDBM50065557
NameBDBM50065557
Synonyms:8-[2-(4-Benzo[1,3]dioxol-5-yl-butylamino)-ethoxy]-6-fluoro-chroman-4-one | CHEMBL94317
TypeSmall organic molecule
Emp. Form.C22H24FNO5
Mol. Mass.401.4281
SMILESFc1cc(OCCNCCCCc2ccc3OCOc3c2)c2OCCC(=O)c2c1