Reaction Details
Target5-hydroxytryptamine receptor 1A
LigandBDBM50065579
Substrate/Competitorn/a
Meas. Tech.ChEMBL_1127 (CHEMBL616072)
Ki 11±n/a nM
Citation Yasunaga, TKimura, TNaito, RKontani, TWanibuchi, FYamashita, HNomura, TTsukamoto, SYamaguchi, TMase, T Synthesis and pharmacological characterization of novel 6-fluorochroman derivatives as potential 5-HT1A receptor antagonists. J Med Chem41:2765-78 (1998) 
 
5-hydroxytryptamine receptor 1A
Name:5-hydroxytryptamine receptor 1A
Type:G Protein-Coupled Receptor (GPCR)
Mol. Mass.:46445.29
Organism:Rattus norvegicus (rat)
Description:Binding assays were performed using rat hippocampal membranes.
Residue:422
BDBM50065579
NameBDBM50065579
Synonyms:4-{4-[2-(6-Fluoro-4-oxo-chroman-8-yloxy)-ethylamino]-butyl}-benzonitrile | CHEMBL96903
TypeSmall organic molecule
Emp. Form.C22H23FN2O3
Mol. Mass.382.428
SMILESFc1cc(OCCNCCCCc2ccc(cc2)C#N)c2OCCC(=O)c2c1