Reaction Details
TargetGenome polyprotein
LigandBDBM50065603
Substrate/Competitorn/a
Meas. Tech.ChEMBL_160898 (CHEMBL771794)
Ki 5±n/a nM
Citation Webber, SEOkano, KLittle, TLReich, SHXin, YFuhrman, SAMatthews, DALove, RAHendrickson, TFPatick, AKMeador, JWFerre, RABrown, ELFord, CEBinford, SLWorland, ST Tripeptide aldehyde inhibitors of human rhinovirus 3C protease: design, synthesis, biological evaluation, and cocrystal structure solution of P1 glutamine isosteric replacements. J Med Chem41:2786-805 (1998) 
 
Genome polyprotein
Name:Genome polyprotein
Type:PROTEIN
Mol. Mass.:44361.04
Organism:Human rhinovirus B
Description:ChEMBL_158953
Residue:401
BDBM50065603
NameBDBM50065603
Synonyms:CHEMBL96185 | {(S)-1-[(S)-1-((S)-1-Formyl-3-methanesulfinyl-propylcarbamoyl)-2-phenyl-ethylcarbamoyl]-3-methyl-butyl}-carbamic acid benzyl ester
TypeSmall organic molecule
Emp. Form.C28H37N3O6S
Mol. Mass.543.675
SMILESCC(C)C[C@H](NC(=O)OCc1ccccc1)C(=O)N[C@@H](Cc1ccccc1)C(=O)N[C@@H](CCS(C)=O)C=O