Reaction Details
TargetGenome polyprotein
LigandBDBM50065593
Substrate/Competitorn/a
Meas. Tech.ChEMBL_160898 (CHEMBL771794)
Ki 146±n/a nM
Citation Webber, SEOkano, KLittle, TLReich, SHXin, YFuhrman, SAMatthews, DALove, RAHendrickson, TFPatick, AKMeador, JWFerre, RABrown, ELFord, CEBinford, SLWorland, ST Tripeptide aldehyde inhibitors of human rhinovirus 3C protease: design, synthesis, biological evaluation, and cocrystal structure solution of P1 glutamine isosteric replacements. J Med Chem41:2786-805 (1998) 
 
Genome polyprotein
Name:Genome polyprotein
Type:PROTEIN
Mol. Mass.:44361.04
Organism:Human rhinovirus B
Description:ChEMBL_158953
Residue:401
BDBM50065593
NameBDBM50065593
Synonyms:((S)-1-{(S)-1-[(S)-1-Formyl-2-(2,2,2-trifluoro-acetylamino)-ethylcarbamoyl]-2-phenyl-ethylcarbamoyl}-3-methyl-butyl)-carbamic acid benzyl ester | CHEMBL94600
TypeSmall organic molecule
Emp. Form.C28H33F3N4O6
Mol. Mass.578.58
SMILESCC(C)C[C@H](NC(=O)OCc1ccccc1)C(=O)N[C@@H](Cc1ccccc1)C(=O)N[C@@H](CNC(=O)C(F)(F)F)C=O