Reaction Details
TargetAdenosine receptor A3
LigandBDBM50059414
Substrate/Competitorn/a
Meas. Tech.ChEMBL_31839 (CHEMBL641516)
Ki 0.003±n/a nM
Citation Kim, YCde Zwart, MChang, LMoro, Svon Frijtag Drabbe Künzel, JKMelman, NIJzerman, APJacobson, KA Derivatives of the triazoloquinazoline adenosine antagonist (CGS 15943) having high potency at the human A2B and A3 receptor subtypes. J Med Chem41:2835-45 (1998) 
 
Adenosine receptor A3
Name:Adenosine receptor A3
Type:G Protein-Coupled Receptor (GPCR)
Mol. Mass.:36197.32
Organism:Homo sapiens (Human)
Description:P0DMS8
Residue:318
BDBM50059414
NameBDBM50059414
Synonyms:2-Methyl-6-phenyl-4-phenylethynyl-1,4-dihydro-pyridine-3,5-dicarboxylic acid 3-ethyl ester 5-(4-nitro-benzyl) ester | CHEMBL265096
TypeSmall organic molecule
Emp. Form.C31H24N2O6
Mol. Mass.520.5321
SMILESCCOC(=O)c1c(C)nc(-c2ccccc2)c(C(=O)OCc2ccc(cc2)[N+]([O-])=O)c1C#Cc1ccccc1