Reaction Details
TargetAdenosine receptor A2a
LigandBDBM50065758
Substrate/Competitorn/a
Meas. Tech.ChEMBL_30000 (CHEMBL643011)
Ki 3.64±n/a nM
Citation Kim, YCde Zwart, MChang, LMoro, Svon Frijtag Drabbe Künzel, JKMelman, NIJzerman, APJacobson, KA Derivatives of the triazoloquinazoline adenosine antagonist (CGS 15943) having high potency at the human A2B and A3 receptor subtypes. J Med Chem41:2835-45 (1998) 
 
Adenosine receptor A2a
Name:Adenosine receptor A2a
Type:G Protein-Coupled Receptor (GPCR)
Mol. Mass.:45015.65
Organism:Rattus norvegicus (rat)
Description:Rat A2A receptors expressed in CHO cells.
Residue:410
BDBM50065758
NameBDBM50065758
Synonyms:CHEMBL98570 | [4-(9-Chloro-2-furan-2-yl-[1,2,4]triazolo[1,5-c]quinazolin-5-ylcarbamoyl)-butyl]-carbamic acid tert-butyl ester
TypeSmall organic molecule
Emp. Form.C23H25ClN6O4
Mol. Mass.484.935
SMILESCC(C)(C)OC(=O)NCCCCC(=O)Nc1nc2ccc(Cl)cc2c2nc(nn12)-c1ccco1