Reaction Details
TargetGenome polyprotein
LigandBDBM50065895
Substrate/Competitorn/a
Meas. Tech.ChEMBL_158967 (CHEMBL766325)
IC50 4300±n/a nM
Citation Yoakim, COgilvie, WWCameron, DRChabot, CGuse, IHaché, BNaud, JO'Meara, JAPlante, RDéziel, R beta-Lactam derivatives as inhibitors of human cytomegalovirus protease. J Med Chem41:2882-91 (1998) 
 
Genome polyprotein
Name:Genome polyprotein
Type:PROTEIN
Mol. Mass.:44361.04
Organism:Human rhinovirus B
Description:ChEMBL_158953
Residue:401
BDBM50065895
NameBDBM50065895
Synonyms:(S)-2-Benzyl-4-oxo-azetidine-1-carboxylic acid methyl-(4-trifluoromethanesulfonyl-benzyl)-amide | CHEMBL95678
TypeSmall organic molecule
Emp. Form.C20H19F3N2O4S
Mol. Mass.440.436
SMILESCN(Cc1ccc(cc1)S(=O)(=O)C(F)(F)F)C(=O)N1[C@@H](Cc2ccccc2)CC1=O