Reaction Details
TargetChymotrypsinogen A
LigandBDBM50065866
Substrate/Competitorn/a
Meas. Tech.ChEMBL_34105 (CHEMBL649734)
IC50 6000±n/a nM
Citation Yoakim, COgilvie, WWCameron, DRChabot, CGuse, IHaché, BNaud, JO'Meara, JAPlante, RDéziel, R beta-Lactam derivatives as inhibitors of human cytomegalovirus protease. J Med Chem41:2882-91 (1998) 
 
Chymotrypsinogen A
Name:Chymotrypsinogen A
Type:Serine protease
Mol. Mass.:25670.88
Organism:Bos taurus (bovine)
Description:n/a
Residue:245
BDBM50065866
NameBDBM50065866
Synonyms:(2S,3S)-3-Allyl-2-benzyl-4-oxo-azetidine-1-carboxylic acid (pyridin-4-ylmethyl)-amide | CHEMBL95813
TypeSmall organic molecule
Emp. Form.C20H21N3O2
Mol. Mass.335.3996
SMILESC=CC[C@H]1[C@H](Cc2ccccc2)N(C(=O)NCc2ccncc2)C1=O