Reaction Details
TargetGlycogen phosphorylase, liver form
LigandBDBM50065951
Substrate/Competitorn/a
Meas. Tech.ChEMBL_99040 (CHEMBL712593)
IC50 110±n/a nM
Citation Hoover, DJLefkowitz-Snow, SBurgess-Henry, JLMartin, WHArmento, SJStock, IAMcPherson, RKGenereux, PEGibbs, EMTreadway, JL Indole-2-carboxamide inhibitors of human liver glycogen phosphorylase. J Med Chem41:2934-8 (1998) 
 
Glycogen phosphorylase, liver form
Name:Glycogen phosphorylase, liver form
Type:Homodimer
Mol. Mass.:97153.98
Organism:Homo sapiens (Human)
Description:Dimers associate into a tetramer to form the enzymatically active phosphorylase A.
Residue:847
BDBM50065951
NameBDBM50065951
Synonyms:5-Chloro-1H-indole-2-carboxylic acid ((S)-1-methylcarbamoyl-2-phenyl-ethyl)-amide | CHEMBL99379
TypeSmall organic molecule
Emp. Form.C19H18ClN3O2
Mol. Mass.355.818
SMILESCNC(=O)[C@H](Cc1ccccc1)NC(=O)c1cc2cc(Cl)ccc2[nH]1