Reaction Details
TargetGlycogen phosphorylase, liver form
LigandBDBM50065948
Substrate/Competitorn/a
Meas. Tech.ChEMBL_99040 (CHEMBL712593)
IC50 210±n/a nM
Citation Hoover, DJLefkowitz-Snow, SBurgess-Henry, JLMartin, WHArmento, SJStock, IAMcPherson, RKGenereux, PEGibbs, EMTreadway, JL Indole-2-carboxamide inhibitors of human liver glycogen phosphorylase. J Med Chem41:2934-8 (1998) 
 
Glycogen phosphorylase, liver form
Name:Glycogen phosphorylase, liver form
Type:Homodimer
Mol. Mass.:97153.98
Organism:Homo sapiens (Human)
Description:Dimers associate into a tetramer to form the enzymatically active phosphorylase A.
Residue:847
BDBM50065948
NameBDBM50065948
Synonyms:(2R,3S)-3-[(5-Chloro-1H-indole-2-carbonyl)-amino]-2-hydroxy-4-phenyl-butyric acid methyl ester | CHEMBL319854
TypeSmall organic molecule
Emp. Form.C20H19ClN2O4
Mol. Mass.386.829
SMILESCOC(=O)[C@H](O)[C@H](Cc1ccccc1)NC(=O)c1cc2cc(Cl)ccc2[nH]1