Reaction Details
TargetPlasma kallikrein
LigandBDBM50066331
Substrate/Competitorn/a
Meas. Tech.ChEMBL_157256 (CHEMBL765456)
Ki 399000±n/a nM
Citation Tucker, TJBrady, SFLumma, WCLewis, SDGardell, SJNaylor-Olsen, AMYan, YSisko, JTStauffer, KJLucas, BJLynch, JJCook, JJStranieri, MTHolahan, MALyle, EABaskin, EPChen, IWDancheck, KBKrueger, JACooper, CMVacca, JP Design and synthesis of a series of potent and orally bioavailable noncovalent thrombin inhibitors that utilize nonbasic groups in the P1 position. J Med Chem41:3210-9 (1998) 
 
Plasma kallikrein
Name:Plasma kallikrein
Type:Protein
Mol. Mass.:71391.16
Organism:Homo sapiens (Human)
Description:P03952
Residue:638
BDBM50066331
NameBDBM50066331
Synonyms:(S)-1-[(R)-2-Cyclohexyl-2-(diethylcarbamoylmethyl-amino)-acetyl]-pyrrolidine-2-carboxylic acid 2,5-dichloro-benzylamide | CHEMBL441468
TypeSmall organic molecule
Emp. Form.C26H38Cl2N4O3
Mol. Mass.525.511
SMILESCCN(CC)C(=O)CN[C@H](C1CCCCC1)C(=O)N1CCC[C@H]1C(=O)NCc1cc(Cl)ccc1Cl