Reaction Details
TargetSerine protease 1
LigandBDBM50066337
Substrate/Competitorn/a
Meas. Tech.ChEMBL_212874 (CHEMBL817824)
Ki 7000±n/a nM
Citation Tucker, TJBrady, SFLumma, WCLewis, SDGardell, SJNaylor-Olsen, AMYan, YSisko, JTStauffer, KJLucas, BJLynch, JJCook, JJStranieri, MTHolahan, MALyle, EABaskin, EPChen, IWDancheck, KBKrueger, JACooper, CMVacca, JP Design and synthesis of a series of potent and orally bioavailable noncovalent thrombin inhibitors that utilize nonbasic groups in the P1 position. J Med Chem41:3210-9 (1998) 
 
Serine protease 1
Name:Serine protease 1
Type:Enzyme
Mol. Mass.:26557.80
Organism:Homo sapiens (Human)
Description:P07477
Residue:247
BDBM50066337
NameBDBM50066337
Synonyms:(S)-1-(2-Amino-3,3-diphenyl-propionyl)-pyrrolidine-2-carboxylic acid 2,5-dichloro-benzylamide | CHEMBL108183
TypeSmall organic molecule
Emp. Form.C27H27Cl2N3O2
Mol. Mass.496.428
SMILESNC(C(c1ccccc1)c1ccccc1)C(=O)N1CCC[C@H]1C(=O)NCc1cc(Cl)ccc1Cl