Reaction Details
TargetPlasminogen
LigandBDBM50066336
Substrate/Competitorn/a
Meas. Tech.ChEMBL_155236 (CHEMBL764726)
Ki 691000±n/a nM
Citation Tucker, TJBrady, SFLumma, WCLewis, SDGardell, SJNaylor-Olsen, AMYan, YSisko, JTStauffer, KJLucas, BJLynch, JJCook, JJStranieri, MTHolahan, MALyle, EABaskin, EPChen, IWDancheck, KBKrueger, JACooper, CMVacca, JP Design and synthesis of a series of potent and orally bioavailable noncovalent thrombin inhibitors that utilize nonbasic groups in the P1 position. J Med Chem41:3210-9 (1998) 
 
Plasminogen
Name:Plasminogen
Type:Enzyme
Mol. Mass.:90579.18
Organism:Homo sapiens (Human)
Description:n/a
Residue:810
BDBM50066336
NameBDBM50066336
Synonyms:(S)-1-((R)-2-Amino-2-cyclohexyl-acetyl)-pyrrolidine-2-carboxylic acid 2,5-dichloro-benzylamide CHEMBL42495
TypeSmall organic molecule
Emp. Form.C20H27Cl2N3O2
Mol. Mass.412.353
SMILESN[C@H](C1CCCCC1)C(=O)N1CCC[C@H]1C(=O)NCc1cc(Cl)ccc1Cl