Reaction Details
TargetProthrombin
LigandBDBM50066336
Substrate/Competitorn/a
Meas. Tech.ChEMBL_208318 (CHEMBL812836)
Ki 5±n/a nM
Citation Tucker, TJBrady, SFLumma, WCLewis, SDGardell, SJNaylor-Olsen, AMYan, YSisko, JTStauffer, KJLucas, BJLynch, JJCook, JJStranieri, MTHolahan, MALyle, EABaskin, EPChen, IWDancheck, KBKrueger, JACooper, CMVacca, JP Design and synthesis of a series of potent and orally bioavailable noncovalent thrombin inhibitors that utilize nonbasic groups in the P1 position. J Med Chem41:3210-9 (1998) 
 
Prothrombin
Name:Prothrombin
Type:Protein
Mol. Mass.:70029.57
Organism:Homo sapiens (Human)
Description:P00734
Residue:622
BDBM50066336
NameBDBM50066336
Synonyms:(S)-1-((R)-2-Amino-2-cyclohexyl-acetyl)-pyrrolidine-2-carboxylic acid 2,5-dichloro-benzylamide CHEMBL42495
TypeSmall organic molecule
Emp. Form.C20H27Cl2N3O2
Mol. Mass.412.353
SMILESN[C@H](C1CCCCC1)C(=O)N1CCC[C@H]1C(=O)NCc1cc(Cl)ccc1Cl