Reaction Details
TargetEndothelin-1 receptor
LigandBDBM50066391
Substrate/Competitorn/a
Meas. Tech.ChEMBL_65654 (CHEMBL678074)
Ki 0.460000±n/a nM
Citation Liu, GHenry, KJSzczepankiewicz, BGWinn, MKozmina, NSBoyd, SAWasicak, Jvon Geldern, TWWu-Wong, JRChiou, WJDixon, DBNguyen, BMarsh, KCOpgenorth, TJ Pyrrolidine-3-carboxylic acids as endothelin antagonists. 3. Discovery of a potent, 2-nonaryl, highly selective ETA antagonist (A-216546). J Med Chem41:3261-75 (1998) 
 
Endothelin-1 receptor
Name:Endothelin-1 receptor
Type:Enzyme Catalytic Domain
Mol. Mass.:48736.88
Organism:Homo sapiens (Human)
Description:P25101
Residue:427
BDBM50066391
NameBDBM50066391
Synonyms:(2S,3R,4S)-1-Dibutylcarbamoylmethyl-2-(2,2-dimethyl-pentyl)-4-(7-methoxy-benzo[1,3]dioxol-5-yl)-pyrrolidine-3-carboxylic acid CHEMBL111612
TypeSmall organic molecule
Emp. Form.C30H48N2O6
Mol. Mass.532.7119
SMILESCCCCN(CCCC)C(=O)CN1C[C@@H]([C@H]([C@@H]1CC(C)(C)CCC)C(O)=O)c1cc2OCOc2c(OC)c1