Reaction Details
TargetEndothelin receptor type B
LigandBDBM50066398
Substrate/Competitorn/a
Meas. Tech.ChEMBL_63852 (CHEMBL672282)
Ki>4300±n/a nM
Citation Liu, GHenry, KJSzczepankiewicz, BGWinn, MKozmina, NSBoyd, SAWasicak, Jvon Geldern, TWWu-Wong, JRChiou, WJDixon, DBNguyen, BMarsh, KCOpgenorth, TJ Pyrrolidine-3-carboxylic acids as endothelin antagonists. 3. Discovery of a potent, 2-nonaryl, highly selective ETA antagonist (A-216546). J Med Chem41:3261-75 (1998) 
 
Endothelin receptor type B
Name:Endothelin receptor type B
Type:Enzyme Catalytic Domain
Mol. Mass.:49664.00
Organism:Homo sapiens (Human)
Description:ENDOTHELIN B EDNRB HUMAN::P24530
Residue:442
BDBM50066398
NameBDBM50066398
Synonyms:3-[2-(6-Methyl-benzo[1,3]dioxol-5-yl)-acetyl]-thiophene-2-sulfonic acid (4-chloro-3-methyl-isoxazol-5-yl)-amide | CHEMBL326059
TypeSmall organic molecule
Emp. Form.C18H15ClN2O6S2
Mol. Mass.454.905
SMILESCc1noc(NS(=O)(=O)c2sccc2C(=O)Cc2cc3OCOc3cc2C)c1Cl