Reaction Details
TargetEndothelin-1 receptor
LigandBDBM50066381
Substrate/Competitorn/a
Meas. Tech.ChEMBL_63360 (CHEMBL679124)
IC50 0.64±n/a nM
Citation Liu, GHenry, KJSzczepankiewicz, BGWinn, MKozmina, NSBoyd, SAWasicak, Jvon Geldern, TWWu-Wong, JRChiou, WJDixon, DBNguyen, BMarsh, KCOpgenorth, TJ Pyrrolidine-3-carboxylic acids as endothelin antagonists. 3. Discovery of a potent, 2-nonaryl, highly selective ETA antagonist (A-216546). J Med Chem41:3261-75 (1998) 
 
Endothelin-1 receptor
Name:Endothelin-1 receptor
Type:Enzyme Catalytic Domain
Mol. Mass.:48256.91
Organism:RAT
Description:ENDOTHELIN A EDNRA RAT::P26684
Residue:426
BDBM50066381
NameBDBM50066381
Synonyms:(2S,3R,4S)-4-Benzo[1,3]dioxol-5-yl-2-(3-cyclopropylidene-propyl)-1-dibutylcarbamoylmethyl-pyrrolidine-3-carboxylic acid | CHEMBL323485
TypeSmall organic molecule
Emp. Form.C28H40N2O5
Mol. Mass.484.6276
SMILES[#6]-[#6]-[#6]-[#6]-[#7](-[#6]-[#6]-[#6]-[#6])-[#6](=O)-[#6]-[#7]-1-[#6]-[#6@@H](-[#6@H](-[#6@@H]-1-[#6]-[#6]\[#6]=[#6]-1/[#6]-[#6]-1)-[#6](-[#8])=O)-c1ccc2-[#8]-[#6]-[#8]-c2c1