Reaction Details
TargetEndothelin-1 receptor
LigandBDBM50066405
Substrate/Competitorn/a
Meas. Tech.ChEMBL_65625 (CHEMBL681508)
IC50 0.29±n/a nM
Citation Liu, GHenry, KJSzczepankiewicz, BGWinn, MKozmina, NSBoyd, SAWasicak, Jvon Geldern, TWWu-Wong, JRChiou, WJDixon, DBNguyen, BMarsh, KCOpgenorth, TJ Pyrrolidine-3-carboxylic acids as endothelin antagonists. 3. Discovery of a potent, 2-nonaryl, highly selective ETA antagonist (A-216546). J Med Chem41:3261-75 (1998) 
 
Endothelin-1 receptor
Name:Endothelin-1 receptor
Type:Enzyme Catalytic Domain
Mol. Mass.:48736.88
Organism:Homo sapiens (Human)
Description:P25101
Residue:427
BDBM50066405
NameBDBM50066405
Synonyms:(2S,3R,4S)-4-Benzo[1,3]dioxol-5-yl-1-dibutylcarbamoylmethyl-2-(2,2-dimethyl-pentyl)-pyrrolidine-3-carboxylic acid | CHEMBL432974
TypeSmall organic molecule
Emp. Form.C29H46N2O5
Mol. Mass.502.6859
SMILESCCCCN(CCCC)C(=O)CN1C[C@@H]([C@H]([C@@H]1CC(C)(C)CCC)C(O)=O)c1ccc2OCOc2c1