Reaction Details
TargetEndothelin receptor type B
LigandBDBM50034435
Substrate/Competitorn/a
Meas. Tech.ChEMBL_63852 (CHEMBL672282)
Ki>50000±n/a nM
Citation Liu, GHenry, KJSzczepankiewicz, BGWinn, MKozmina, NSBoyd, SAWasicak, Jvon Geldern, TWWu-Wong, JRChiou, WJDixon, DBNguyen, BMarsh, KCOpgenorth, TJ Pyrrolidine-3-carboxylic acids as endothelin antagonists. 3. Discovery of a potent, 2-nonaryl, highly selective ETA antagonist (A-216546). J Med Chem41:3261-75 (1998) 
 
Endothelin receptor type B
Name:Endothelin receptor type B
Type:Enzyme Catalytic Domain
Mol. Mass.:49664.00
Organism:Homo sapiens (Human)
Description:ENDOTHELIN B EDNRB HUMAN::P24530
Residue:442
BDBM50034435
NameBDBM50034435
Synonyms:5-Dimethylamino-naphthalene-1-sulfonic acid (3,4-dimethyl-2,3-dihydro-oxazol-5-yl)-amide 5-Dimethylamino-naphthalene-1-sulfonic acid (3,4-dimethyl-isoxazol-5-yl)-amide (BMS 182874) CHEMBL267458
TypeSmall organic molecule
Emp. Form.C17H19N3O3S
Mol. Mass.345.416
SMILESCN(C)c1cccc2c(cccc12)S(=O)(=O)Nc1onc(C)c1C