Reaction Details
TargetEndothelin-1 receptor
LigandBDBM50066378
Substrate/Competitorn/a
Meas. Tech.ChEMBL_63360 (CHEMBL679124)
IC50 1.4±n/a nM
Citation Liu, GHenry, KJSzczepankiewicz, BGWinn, MKozmina, NSBoyd, SAWasicak, Jvon Geldern, TWWu-Wong, JRChiou, WJDixon, DBNguyen, BMarsh, KCOpgenorth, TJ Pyrrolidine-3-carboxylic acids as endothelin antagonists. 3. Discovery of a potent, 2-nonaryl, highly selective ETA antagonist (A-216546). J Med Chem41:3261-75 (1998) 
 
Endothelin-1 receptor
Name:Endothelin-1 receptor
Type:Enzyme Catalytic Domain
Mol. Mass.:48256.91
Organism:RAT
Description:ENDOTHELIN A EDNRA RAT::P26684
Residue:426
BDBM50066378
NameBDBM50066378
Synonyms:(2S,3R,4S)-4-Benzo[1,3]dioxol-5-yl-1-dibutylcarbamoylmethyl-2-(2-[1,3]dioxolan-2-yl-2-methyl-propyl)-pyrrolidine-3-carboxylic acid | CHEMBL111611
TypeSmall organic molecule
Emp. Form.C29H44N2O7
Mol. Mass.532.6689
SMILESCCCCN(CCCC)C(=O)CN1C[C@@H]([C@H]([C@@H]1CC(C)(C)C1OCCO1)C(O)=O)c1ccc2OCOc2c1