Reaction Details
TargetReverse transcriptase/RNaseH
LigandBDBM50066474
Substrate/Competitorn/a
Meas. Tech.ChEMBL_195842 (CHEMBL799141)
IC50 14±n/a nM
Citation Bold, GFässler, ACapraro, HGCozens, RKlimkait, TLazdins, JMestan, JPoncioni, BRösel, JStover, DTintelnot-Blomley, MAcemoglu, FBeck, WBoss, EEschbach, MHürlimann, TMasso, ERoussel, SUcci-Stoll, KWyss, DLang, M New aza-dipeptide analogues as potent and orally absorbed HIV-1 protease inhibitors: candidates for clinical development. J Med Chem41:3387-401 (1998) 
 
Reverse transcriptase/RNaseH
Name:Reverse transcriptase/RNaseH
Type:PROTEIN
Mol. Mass.:65229.15
Organism:Human immunodeficiency virus 1
Description:ChEMBL_1473730
Residue:566
BDBM50066474
NameBDBM50066474
Synonyms:((S)-1-{(1S,2S)-1-Benzyl-2-hydroxy-3-[N'-((S)-2-methoxycarbonylamino-3-methyl-butyryl)-N-(4-thiazol-5-yl-benzyl)-hydrazino]-propylcarbamoyl}-2,2-dimethyl-propyl)-carbamic acid methyl ester | CHEMBL326513
TypeSmall organic molecule
Emp. Form.C35H48N6O7S
Mol. Mass.696.857
SMILESCOC(=O)N[C@@H](C(C)C)C(=O)NN(C[C@H](O)[C@H](Cc1ccccc1)NC(=O)[C@@H](NC(=O)OC)C(C)(C)C)Cc1ccc(cc1)-c1cncs1