Reaction Details
TargetReverse transcriptase/RNaseH
LigandBDBM13934
Substrate/Competitorn/a
Meas. Tech.ChEMBL_195842 (CHEMBL799141)
IC50 26±n/a nM
Citation Bold, GFässler, ACapraro, HGCozens, RKlimkait, TLazdins, JMestan, JPoncioni, BRösel, JStover, DTintelnot-Blomley, MAcemoglu, FBeck, WBoss, EEschbach, MHürlimann, TMasso, ERoussel, SUcci-Stoll, KWyss, DLang, M New aza-dipeptide analogues as potent and orally absorbed HIV-1 protease inhibitors: candidates for clinical development. J Med Chem41:3387-401 (1998) 
 
Reverse transcriptase/RNaseH
Name:Reverse transcriptase/RNaseH
Type:PROTEIN
Mol. Mass.:65229.15
Organism:Human immunodeficiency virus 1
Description:ChEMBL_1473730
Residue:566
BDBM13934
NameBDBM13934
Synonyms:Atazanavir CGP 73547 Latazanavir methyl N-[(1S)-1-[[(2S,3S)-3-hydroxy-4-[[[(2S)-2-(methoxycarbonylamino)-3,3-dimethyl-butanoyl]amino]-[(4-pyridin-2-ylphenyl)methyl]amino]-1-phenyl-butan-2-yl]carbamoyl]-2,2-dimethyl-propyl]carbamate | methyl N-[(1S)-1-{[(2S,3S)-3-hydroxy-4-[(2S)-2-[(methoxycarbonyl)amino]-3,3-dimethyl-N'-{[4-(pyridin-2-yl)phenyl]methyl}butanehydrazido]-1-phenylbutan-2-yl]carbamoyl}-2,2-dimethylpropyl]carbamate
TypeSmall organic molecule
Emp. Form.C38H52N6O7
Mol. Mass.704.8555
SMILESCOC(=O)N[C@H](C(=O)N[C@@H](Cc1ccccc1)[C@@H](O)CN(Cc1ccc(cc1)-c1ccccn1)NC(=O)[C@@H](NC(=O)OC)C(C)(C)C)C(C)(C)C