Reaction Details
TargetReverse transcriptase/RNaseH
LigandBDBM50066469
Substrate/Competitorn/a
Meas. Tech.ChEMBL_195842 (CHEMBL799141)
IC50 34±n/a nM
Citation Bold, GFässler, ACapraro, HGCozens, RKlimkait, TLazdins, JMestan, JPoncioni, BRösel, JStover, DTintelnot-Blomley, MAcemoglu, FBeck, WBoss, EEschbach, MHürlimann, TMasso, ERoussel, SUcci-Stoll, KWyss, DLang, M New aza-dipeptide analogues as potent and orally absorbed HIV-1 protease inhibitors: candidates for clinical development. J Med Chem41:3387-401 (1998) 
 
Reverse transcriptase/RNaseH
Name:Reverse transcriptase/RNaseH
Type:PROTEIN
Mol. Mass.:65229.15
Organism:Human immunodeficiency virus 1
Description:ChEMBL_1473730
Residue:566
BDBM50066469
NameBDBM50066469
Synonyms:CHEMBL113943 | {(S)-1-[N'-[(2S,3S)-2-Hydroxy-3-((S)-2-methoxycarbonylamino-3-methyl-butyrylamino)-4-phenyl-butyl]-N'-(4-pyridin-2-yl-benzyl)-hydrazinocarbonyl]-2-methyl-propyl}-carbamic acid ethyl ester
TypeSmall organic molecule
Emp. Form.C37H50N6O7
Mol. Mass.690.8289
SMILESCCOC(=O)N[C@@H](C(C)C)C(=O)NN(C[C@H](O)[C@H](Cc1ccccc1)NC(=O)[C@@H](NC(=O)OC)C(C)C)Cc1ccc(cc1)-c1ccccn1