Reaction Details
TargetReverse transcriptase/RNaseH
LigandBDBM50066470
Substrate/Competitorn/a
Meas. Tech.ChEMBL_195842 (CHEMBL799141)
IC50 72±n/a nM
Citation Bold, GFässler, ACapraro, HGCozens, RKlimkait, TLazdins, JMestan, JPoncioni, BRösel, JStover, DTintelnot-Blomley, MAcemoglu, FBeck, WBoss, EEschbach, MHürlimann, TMasso, ERoussel, SUcci-Stoll, KWyss, DLang, M New aza-dipeptide analogues as potent and orally absorbed HIV-1 protease inhibitors: candidates for clinical development. J Med Chem41:3387-401 (1998) 
 
Reverse transcriptase/RNaseH
Name:Reverse transcriptase/RNaseH
Type:PROTEIN
Mol. Mass.:65229.15
Organism:Human immunodeficiency virus 1
Description:ChEMBL_1473730
Residue:566
BDBM50066470
NameBDBM50066470
Synonyms:((S)-1-{N'-[4-(2-tert-Butyl-2H-tetrazol-5-yl)-benzyl]-N'-[(2S,3S)-2-hydroxy-3-((S)-2-methoxycarbonylamino-3,3-dimethyl-butyrylamino)-4-phenyl-butyl]-hydrazinocarbonyl}-2,2-dimethyl-propyl)-carbamic acid methyl ester | CHEMBL325271
TypeSmall organic molecule
Emp. Form.C38H57N9O7
Mol. Mass.751.9153
SMILESCOC(=O)N[C@H](C(=O)N[C@@H](Cc1ccccc1)[C@@H](O)CN(Cc1ccc(cc1)-c1nnn(n1)C(C)(C)C)NC(=O)[C@@H](NC(=O)OC)C(C)(C)C)C(C)(C)C