Reaction Details
TargetCoagulation factor X
LigandBDBM50066617
Substrate/Competitorn/a
Meas. Tech.ChEMBL_48821 (CHEMBL661794)
Ki 26±n/a nM
Citation Phillips, GBBuckman, BODavey, DDEagen, KAGuilford, WJHinchman, JHo, EKoovakkat, SLiang, ALight, DRMohan, RNg, HPPost, JMShaw, KJSmith, DSubramanyam, BSullivan, METrinh, LVergona, RWalters, JWhite, KWhitlow, MWu, SXu, WMorrissey, MM Discovery of N-[2-[5-[Amino(imino)methyl]-2-hydroxyphenoxy]-3, 5-difluoro-6-[3-(4, 5-dihydro-1-methyl-1H-imidazol-2-yl)phenoxy]pyridin-4-yl]-N-methylgl y cine (ZK-807834): a potent, selective, and orally active inhibitor of the blood coagulation enzyme factor Xa. J Med Chem41:3557-62 (1998) 
 
Coagulation factor X
Name:Coagulation factor X
Type:Enzyme
Mol. Mass.:54726.60
Organism:Homo sapiens (Human)
Description:n/a
Residue:488
BDBM50066617
NameBDBM50066617
Synonyms:2-(5-Carbamimidoyl-2-hydroxy-phenoxy)-6-(3-imidazol-1-yl-phenoxy)-isonicotinic acid | CHEMBL310373
TypeSmall organic molecule
Emp. Form.C22H17N5O5
Mol. Mass.431.4009
SMILESNC(=N)c1ccc(O)c(Oc2cc(cc(Oc3cccc(c3)-n3ccnc3)n2)C(O)=O)c1