Reaction Details
TargetCoagulation factor X
LigandBDBM50066635
Substrate/Competitorn/a
Meas. Tech.ChEMBL_48821 (CHEMBL661794)
Ki 0.24±n/a nM
Citation Phillips, GBBuckman, BODavey, DDEagen, KAGuilford, WJHinchman, JHo, EKoovakkat, SLiang, ALight, DRMohan, RNg, HPPost, JMShaw, KJSmith, DSubramanyam, BSullivan, METrinh, LVergona, RWalters, JWhite, KWhitlow, MWu, SXu, WMorrissey, MM Discovery of N-[2-[5-[Amino(imino)methyl]-2-hydroxyphenoxy]-3, 5-difluoro-6-[3-(4, 5-dihydro-1-methyl-1H-imidazol-2-yl)phenoxy]pyridin-4-yl]-N-methylgl y cine (ZK-807834): a potent, selective, and orally active inhibitor of the blood coagulation enzyme factor Xa. J Med Chem41:3557-62 (1998) 
 
Coagulation factor X
Name:Coagulation factor X
Type:Enzyme
Mol. Mass.:54726.60
Organism:Homo sapiens (Human)
Description:n/a
Residue:488
BDBM50066635
NameBDBM50066635
Synonyms:(4-{2-(5-Carbamimidoyl-2-hydroxy-phenoxy)-3,5-difluoro-6-[3-(1-methyl-4,5-dihydro-1H-imidazol-2-yl)-phenoxy]-pyridin-4-yloxy}-piperidin-1-yl)-acetic acid | CHEMBL332322
TypeSmall organic molecule
Emp. Form.C29H30F2N6O6
Mol. Mass.596.5819
SMILESCN1CCN=C1c1cccc(Oc2nc(Oc3cc(ccc3O)C(N)=N)c(F)c(OC3CCN(CC(O)=O)CC3)c2F)c1