Reaction Details
TargetCoagulation factor X
LigandBDBM50066619
Substrate/Competitorn/a
Meas. Tech.ChEMBL_48821 (CHEMBL661794)
Ki 0.26±n/a nM
Citation Phillips, GBBuckman, BODavey, DDEagen, KAGuilford, WJHinchman, JHo, EKoovakkat, SLiang, ALight, DRMohan, RNg, HPPost, JMShaw, KJSmith, DSubramanyam, BSullivan, METrinh, LVergona, RWalters, JWhite, KWhitlow, MWu, SXu, WMorrissey, MM Discovery of N-[2-[5-[Amino(imino)methyl]-2-hydroxyphenoxy]-3, 5-difluoro-6-[3-(4, 5-dihydro-1-methyl-1H-imidazol-2-yl)phenoxy]pyridin-4-yl]-N-methylgl y cine (ZK-807834): a potent, selective, and orally active inhibitor of the blood coagulation enzyme factor Xa. J Med Chem41:3557-62 (1998) 
 
Coagulation factor X
Name:Coagulation factor X
Type:Enzyme
Mol. Mass.:54726.60
Organism:Homo sapiens (Human)
Description:n/a
Residue:488
BDBM50066619
NameBDBM50066619
Synonyms:({2-(5-Carbamimidoyl-2-hydroxy-phenoxy)-3,5-difluoro-6-[3-(1-methyl-4,5-dihydro-1H-imidazol-2-yl)-phenoxy]-pyridin-4-yl}-methyl-amino)-acetic acid ethyl ester | CHEMBL333266
TypeSmall organic molecule
Emp. Form.C27H28F2N6O5
Mol. Mass.554.5452
SMILESCCOC(=O)CN(C)c1c(F)c(Oc2cccc(c2)C2=NCCN2C)nc(Oc2cc(ccc2O)C(N)=N)c1F