Reaction Details
TargetProcathepsin L
LigandBDBM50066645
Substrate/Competitorn/a
Meas. Tech.ChEMBL_48507 (CHEMBL660656)
Ki>1000±n/a nM
Citation Marquis, RWYamashita, DSRu, YLoCastro, SMOh, HJErhard, KFDesJarlais, RLHead, MSSmith, WWZhao, BJanson, CAAbdel-Meguid, SSTomaszek, TALevy, MAVeber, DF Conformationally constrained 1,3-diamino ketones: a series of potent inhibitors of the cysteine protease cathepsin K. J Med Chem41:3563-7 (1998) 
 
Procathepsin L
Name:Procathepsin L
Type:Enzyme
Mol. Mass.:37557.19
Organism:Homo sapiens (Human)
Description:Purchased from Calbiochem (San Diego, CA).
Residue:333
BDBM50066645
NameBDBM50066645
Synonyms:CHEMBL432634 | {(S)-3-Methyl-1-[1-(4-methyl-pentyl)-3-oxo-piperidin-4-ylcarbamoyl]-butyl}-carbamic acid benzyl ester
TypeSmall organic molecule
Emp. Form.C25H39N3O4
Mol. Mass.445.5949
SMILESCC(C)CCCN1CCC(NC(=O)[C@H](CC(C)C)NC(=O)OCc2ccccc2)C(=O)C1