Reaction Details
TargetCathepsin K
LigandBDBM19807
Substrate/Competitorn/a
Meas. Tech.ChEMBL_48326 (CHEMBL663316)
Ki 2.3±n/a nM
Citation Marquis, RWYamashita, DSRu, YLoCastro, SMOh, HJErhard, KFDesJarlais, RLHead, MSSmith, WWZhao, BJanson, CAAbdel-Meguid, SSTomaszek, TALevy, MAVeber, DF Conformationally constrained 1,3-diamino ketones: a series of potent inhibitors of the cysteine protease cathepsin K. J Med Chem41:3563-7 (1998) 
 
Cathepsin K
Name:Cathepsin K
Type:Enzyme
Mol. Mass.:36975.68
Organism:Homo sapiens (Human)
Description:P43235
Residue:329
BDBM19807
NameBDBM19807
Synonyms:CHEMBL100563 pyrrolidinone analogue, 24
TypeSmall organic molecule
Emp. Form.C32H42N4O7
Mol. Mass.594.6985
SMILESCC(C)C[C@H](NC(=O)OCc1ccccc1)C(=O)NC1CN(CC1=O)C(=O)[C@H](CC(C)C)NC(=O)OCc1ccccc1