Reaction Details
TargetCathepsin K
LigandBDBM50066653
Substrate/Competitorn/a
Meas. Tech.ChEMBL_48326 (CHEMBL663316)
Ki 30±n/a nM
Citation Marquis, RWYamashita, DSRu, YLoCastro, SMOh, HJErhard, KFDesJarlais, RLHead, MSSmith, WWZhao, BJanson, CAAbdel-Meguid, SSTomaszek, TALevy, MAVeber, DF Conformationally constrained 1,3-diamino ketones: a series of potent inhibitors of the cysteine protease cathepsin K. J Med Chem41:3563-7 (1998) 
 
Cathepsin K
Name:Cathepsin K
Type:Enzyme
Mol. Mass.:36975.68
Organism:Homo sapiens (Human)
Description:P43235
Residue:329
BDBM50066653
NameBDBM50066653
Synonyms:CHEMBL119219 | {(S)-3-Methyl-1-[4-oxo-1-(4-phenoxy-benzoyl)-pyrrolidin-3-ylcarbamoyl]-butyl}-carbamic acid benzyl ester
TypeSmall organic molecule
Emp. Form.C31H33N3O6
Mol. Mass.543.6102
SMILESCC(C)C[C@H](NC(=O)OCc1ccccc1)C(=O)NC1CN(CC1=O)C(=O)c1ccc(Oc2ccccc2)cc1