Reaction Details
TargetCannabinoid receptor 1
LigandBDBM50066707
Substrate/Competitorn/a
Meas. Tech.ChEMBL_46647 (CHEMBL658902)
Ki 11.1±n/a nM
Citation Drake, DJJensen, RSBusch-Petersen, JKawakami, JKConcepcion Fernandez-Garcia, MFan, PMakriyannis, ATius, MA Classical/nonclassical hybrid cannabinoids: southern aliphatic chain-functionalized C-6beta methyl, ethyl, and propyl analogues. J Med Chem41:3596-608 (1998) 
 
Cannabinoid receptor 1
Name:Cannabinoid receptor 1
Type:G Protein-Coupled Receptor (GPCR)
Mol. Mass.:52856.55
Organism:Rattus norvegicus (rat)
Description:P20272
Residue:473
BDBM50066707
NameBDBM50066707
Synonyms:(6S,6aR,9R,10aR)-3-(1,1-Dimethyl-heptyl)-6-ethyl-9-hydroxymethyl-6-methyl-6a,7,8,9,10,10a-hexahydro-6H-benzo[c]chromen-1-ol | CHEMBL120644
TypeSmall organic molecule
Emp. Form.C26H42O3
Mol. Mass.402.6099
SMILESCCCCCCC(C)(C)c1cc(O)c2[C@@H]3C[C@H](CO)CC[C@H]3[C@](C)(CC)Oc2c1