Reaction Details
TargetRetinoic acid receptor alpha
LigandBDBM50066898
Substrate/Competitorn/a
Meas. Tech.ChEMBL_197392 (CHEMBL799711)
EC50 2300±n/a nM
Citation Benbrook, DMSubramanian, SGale, JBLiu, SBrown, CWBoehm, MFBerlin, KD Synthesis and characterization of heteroarotinoids demonstrate structure specificity relationships. J Med Chem41:3753-7 (1998) 
 
Retinoic acid receptor alpha
Name:Retinoic acid receptor alpha
Type:PROTEIN
Mol. Mass.:50778.87
Organism:Homo sapiens (Human)
Description:ChEMBL_1466191
Residue:462
BDBM50066898
NameBDBM50066898
Synonyms:4-[(E)-2-(3,3-Dimethyl-2,3-dihydro-benzofuran-5-yl)-propenyl]-benzoic acid | CHEMBL120759
TypeSmall organic molecule
Emp. Form.C20H20O3
Mol. Mass.308.371
SMILESC\C(=C/c1ccc(cc1)C(O)=O)c1ccc2OCC(C)(C)c2c1