Reaction Details
TargetReverse transcriptase/RNaseH
LigandBDBM50066933
Substrate/Competitorn/a
Meas. Tech.ChEMBL_195847 (CHEMBL799146)
IC50 6660±n/a nM
Citation Nugent, RASchlachter, STMurphy, MJCleek, GJPoel, TJWishka, DGGraber, DRYagi, YKeiser, BJOlmsted, RAKopta, LASwaney, SMPoppe, SMMorris, JTarpley, WGThomas, RC Pyrimidine thioethers: a novel class of HIV-1 reverse transcriptase inhibitors with activity against BHAP-resistant HIV. J Med Chem41:3793-803 (1998) 
 
Reverse transcriptase/RNaseH
Name:Reverse transcriptase/RNaseH
Type:PROTEIN
Mol. Mass.:65229.15
Organism:Human immunodeficiency virus 1
Description:ChEMBL_1473730
Residue:566
BDBM50066933
NameBDBM50066933
Synonyms:2-Benzylsulfanyl-6-chloro-pyrimidin-4-ylamine | CHEMBL124578
TypeSmall organic molecule
Emp. Form.C11H10ClN3S
Mol. Mass.251.735
SMILESNc1cc(Cl)nc(SCc2ccccc2)n1