Reaction Details
TargetReverse transcriptase/RNaseH
LigandBDBM50066931
Substrate/Competitorn/a
Meas. Tech.ChEMBL_195847 (CHEMBL799146)
IC50 60±n/a nM
Citation Nugent, RASchlachter, STMurphy, MJCleek, GJPoel, TJWishka, DGGraber, DRYagi, YKeiser, BJOlmsted, RAKopta, LASwaney, SMPoppe, SMMorris, JTarpley, WGThomas, RC Pyrimidine thioethers: a novel class of HIV-1 reverse transcriptase inhibitors with activity against BHAP-resistant HIV. J Med Chem41:3793-803 (1998) 
 
Reverse transcriptase/RNaseH
Name:Reverse transcriptase/RNaseH
Type:PROTEIN
Mol. Mass.:65229.15
Organism:Human immunodeficiency virus 1
Description:ChEMBL_1473730
Residue:566
BDBM50066931
NameBDBM50066931
Synonyms:(E)-4-(4-Amino-6-chloro-pyrimidin-2-ylsulfanyl)-but-2-enoic acid diethylamide | CHEMBL123959
TypeSmall organic molecule
Emp. Form.C12H17ClN4OS
Mol. Mass.300.808
SMILESCCN(CC)C(=O)\C=C\CSc1nc(N)cc(Cl)n1