Reaction Details
TargetReverse transcriptase/RNaseH
LigandBDBM50066925
Substrate/Competitorn/a
Meas. Tech.ChEMBL_195847 (CHEMBL799146)
IC50 980±n/a nM
Citation Nugent, RASchlachter, STMurphy, MJCleek, GJPoel, TJWishka, DGGraber, DRYagi, YKeiser, BJOlmsted, RAKopta, LASwaney, SMPoppe, SMMorris, JTarpley, WGThomas, RC Pyrimidine thioethers: a novel class of HIV-1 reverse transcriptase inhibitors with activity against BHAP-resistant HIV. J Med Chem41:3793-803 (1998) 
 
Reverse transcriptase/RNaseH
Name:Reverse transcriptase/RNaseH
Type:PROTEIN
Mol. Mass.:65229.15
Organism:Human immunodeficiency virus 1
Description:ChEMBL_1473730
Residue:566
BDBM50066925
NameBDBM50066925
Synonyms:6-Chloro-2-(3-methoxy-benzylsulfanyl)-pyrimidin-4-ylamine | CHEMBL334129
TypeSmall organic molecule
Emp. Form.C12H12ClN3OS
Mol. Mass.281.761
SMILESCOc1cccc(CSc2nc(N)cc(Cl)n2)c1