Reaction Details
TargetL-lactate dehydrogenase B chain
LigandBDBM50066975
Substrate/Competitorn/a
Meas. Tech.ChEMBL_96433 (CHEMBL706380)
Ki 200±n/a nM
Citation Deck, LMRoyer, REChamblee, BBHernandez, VMMalone, RRTorres, JEHunsaker, LAPiper, RCMakler, MTVander Jagt, DL Selective inhibitors of human lactate dehydrogenases and lactate dehydrogenase from the malarial parasite Plasmodium falciparum. J Med Chem41:3879-87 (1998) 
 
L-lactate dehydrogenase B chain
Name:L-lactate dehydrogenase B chain
Type:Oxidoreductase; homotetramer
Mol. Mass.:36635.55
Organism:Homo sapiens (Human)
Description:n/a
Residue:334
BDBM50066975
NameBDBM50066975
Synonyms:7-Benzyl-2,3-dihydroxy-4-isopropyl-6-methyl-naphthalene-1-carboxylic acid | CHEMBL341463
TypeSmall organic molecule
Emp. Form.C22H22O4
Mol. Mass.350.4077
SMILESCC(C)c1c(O)c(O)c(C(O)=O)c2cc(Cc3ccccc3)c(C)cc12