Reaction Details
TargetL-lactate dehydrogenase B chain
LigandBDBM50031638
Substrate/Competitorn/a
Meas. Tech.ChEMBL_96432 (CHEMBL706379)
Ki 91000±n/a nM
Citation Deck, LMRoyer, REChamblee, BBHernandez, VMMalone, RRTorres, JEHunsaker, LAPiper, RCMakler, MTVander Jagt, DL Selective inhibitors of human lactate dehydrogenases and lactate dehydrogenase from the malarial parasite Plasmodium falciparum. J Med Chem41:3879-87 (1998) 
 
L-lactate dehydrogenase B chain
Name:L-lactate dehydrogenase B chain
Type:Oxidoreductase; homotetramer
Mol. Mass.:36635.55
Organism:Homo sapiens (Human)
Description:n/a
Residue:334
BDBM50031638
NameBDBM50031638
Synonyms:2,3-Dihydroxy-4-isopropyl-6-methyl-naphthalene-1-carboxylic acid | CHEMBL310405
TypeSmall organic molecule
Emp. Form.C15H16O4
Mol. Mass.260.2851
SMILESCC(C)c1c(O)c(O)c(C(O)=O)c2ccc(C)cc12