Reaction Details
TargetL-lactate dehydrogenase B chain
LigandBDBM50066973
Substrate/Competitorn/a
Meas. Tech.ChEMBL_96433 (CHEMBL706380)
Ki 13000±n/a nM
Citation Deck, LMRoyer, REChamblee, BBHernandez, VMMalone, RRTorres, JEHunsaker, LAPiper, RCMakler, MTVander Jagt, DL Selective inhibitors of human lactate dehydrogenases and lactate dehydrogenase from the malarial parasite Plasmodium falciparum. J Med Chem41:3879-87 (1998) 
 
L-lactate dehydrogenase B chain
Name:L-lactate dehydrogenase B chain
Type:Oxidoreductase; homotetramer
Mol. Mass.:36635.55
Organism:Homo sapiens (Human)
Description:n/a
Residue:334
BDBM50066973
NameBDBM50066973
Synonyms:2,3-Dihydroxy-4-isopropyl-6-methyl-7-(4-trifluoromethyl-benzyl)-naphthalene-1-carboxylic acid | CHEMBL338262
TypeSmall organic molecule
Emp. Form.C23H21F3O4
Mol. Mass.418.4056
SMILESCC(C)c1c(O)c(O)c(C(O)=O)c2cc(Cc3ccc(cc3)C(F)(F)F)c(C)cc12