Reaction Details
TargetL-lactate dehydrogenase B chain
LigandBDBM50066980
Substrate/Competitorn/a
Meas. Tech.ChEMBL_96432 (CHEMBL706379)
Ki 190000±n/a nM
Citation Deck, LMRoyer, REChamblee, BBHernandez, VMMalone, RRTorres, JEHunsaker, LAPiper, RCMakler, MTVander Jagt, DL Selective inhibitors of human lactate dehydrogenases and lactate dehydrogenase from the malarial parasite Plasmodium falciparum. J Med Chem41:3879-87 (1998) 
 
L-lactate dehydrogenase B chain
Name:L-lactate dehydrogenase B chain
Type:Oxidoreductase; homotetramer
Mol. Mass.:36635.55
Organism:Homo sapiens (Human)
Description:n/a
Residue:334
BDBM50066980
NameBDBM50066980
Synonyms:2,3-Dihydroxy-4,6,7-trimethyl-naphthalene-1-carboxylic acid | CHEMBL127334
TypeSmall organic molecule
Emp. Form.C14H14O4
Mol. Mass.246.2586
SMILESCc1cc2c(C)c(O)c(O)c(C(O)=O)c2cc1C