Reaction Details
TargetPeptidyl-prolyl cis-trans isomerase FKBP1A
LigandBDBM50067004
Substrate/Competitorn/a
Meas. Tech.ChEMBL_195890 (CHEMBL804190)
Ki 17.0±n/a nM
Citation Lamb, MLJorgensen, WL Investigations of neurotrophic inhibitors of FK506 binding protein via Monte Carlo simulations. J Med Chem41:3928-39 (1998) 
 
Peptidyl-prolyl cis-trans isomerase FKBP1A
Name:Peptidyl-prolyl cis-trans isomerase FKBP1A
Type:Isomerase
Mol. Mass.:11953.09
Organism:Homo sapiens (Human)
Description:P62942
Residue:108
BDBM50067004
NameBDBM50067004
Synonyms:(S)-1-(3,3-Dimethyl-2-oxo-pentanoyl)-piperidine-2-carboxylic acid (R)-1,3-diphenyl-propyl ester CHEMBL126568
TypeSmall organic molecule
Emp. Form.C28H35NO4
Mol. Mass.449.5818
SMILESCCC(C)(C)C(=O)C(=O)N1CCCC[C@H]1C(=O)O[C@H](CCc1ccccc1)c1ccccc1