Reaction Details
TargetPeptidyl-prolyl cis-trans isomerase FKBP1A
LigandBDBM23334
Substrate/Competitorn/a
Meas. Tech.ChEMBL_195890 (CHEMBL804190)
Ki 7.5±n/a nM
Citation Lamb, MLJorgensen, WL Investigations of neurotrophic inhibitors of FK506 binding protein via Monte Carlo simulations. J Med Chem41:3928-39 (1998) 
 
Peptidyl-prolyl cis-trans isomerase FKBP1A
Name:Peptidyl-prolyl cis-trans isomerase FKBP1A
Type:Isomerase
Mol. Mass.:11953.09
Organism:Homo sapiens (Human)
Description:P62942
Residue:108
BDBM23334
NameBDBM23334
Synonyms:3-(pyridin-3-yl)propyl (2S)-1-(3,3-dimethyl-2-oxopentanoyl)pyrrolidine-2-carboxylate GPI 1046
TypeSmall organic molecule
Emp. Form.C20H28N2O4
Mol. Mass.360.4473
SMILESCCC(C)(C)C(=O)C(=O)N1CCC[C@H]1C(=O)OCCCc1cccnc1