Reaction Details
TargetPeptidyl-prolyl cis-trans isomerase FKBP1A
LigandBDBM50067003
Substrate/Competitorn/a
Meas. Tech.ChEMBL_195890 (CHEMBL804190)
Ki 130±n/a nM
Citation Lamb, MLJorgensen, WL Investigations of neurotrophic inhibitors of FK506 binding protein via Monte Carlo simulations. J Med Chem41:3928-39 (1998) 
 
Peptidyl-prolyl cis-trans isomerase FKBP1A
Name:Peptidyl-prolyl cis-trans isomerase FKBP1A
Type:Isomerase
Mol. Mass.:11953.09
Organism:Homo sapiens (Human)
Description:P62942
Residue:108
BDBM50067003
NameBDBM50067003
Synonyms:(S)-1-(3,3-Dimethyl-2-oxo-pentanoyl)-piperidine-2-carboxylic acid 3-pyridin-3-yl-propyl ester | CHEMBL129537
TypeSmall organic molecule
Emp. Form.C21H30N2O4
Mol. Mass.374.4739
SMILESCCC(C)(C)C(=O)C(=O)N1CCCC[C@H]1C(=O)OCCCc1cccnc1