Reaction Details
TargetAldo-keto reductase family 1 member B1
LigandBDBM50067385
Substrate/Competitorn/a
Meas. Tech.ChEMBL_31797 (CHEMBL643203)
IC50 270±n/a nM
Citation Negoro, TMurata, MUeda, SFujitani, BOno, YKuromiya, AKomiya, MSuzuki, KMatsumoto, J Novel, highly potent aldose reductase inhibitors: (R)-(-)-2-(4-bromo-2-fluorobenzyl)-1,2,3,4- tetrahydropyrrolo[1,2-a]pyrazine -4-spiro-3'-pyrrolidine-1,2',3,5'-tetrone (AS-3201) and its congeners. J Med Chem41:4118-29 (1998) 
 
Aldo-keto reductase family 1 member B1
Name:Aldo-keto reductase family 1 member B1
Type:PROTEIN
Mol. Mass.:35865.31
Organism:Sus scrofa
Description:ChEMBL_502637
Residue:316
BDBM50067385
NameBDBM50067385
Synonyms:2'-phenethylspiro[tetrahydro-1H-pyrrole-3,4'-(1',2',3',4'-tetrahydropyrrolo[1,2-a]pyrazine)]-1',2,3',5-tetraone | CHEMBL132245
TypeSmall organic molecule
Emp. Form.C18H15N3O4
Mol. Mass.337.3294
SMILESO=C1CC2(C(=O)N1)C(=O)N(CCc1ccccc1)C(=O)c1cccn21