Reaction Details
TargetGABA-A receptor; alpha-5/beta-3/gamma-2
LigandBDBM50049738
Substrate/Competitorn/a
Meas. Tech.ChEMBL_70702 (CHEMBL685338)
Ki 5±n/a nM
Citation Huang, QLiu, RZhang, PHe, XMcKernan, RGan, TBennett, DWCook, JM Predictive models for GABAA/benzodiazepine receptor subtypes: studies of quantitative structure-activity relationships for imidazobenzodiazepines at five recombinant GABAA/benzodiazepine receptor subtypes [alphaxbeta3gamma2 (x = 1-3, 5, and 6)] via comparative molecular field analysis. J Med Chem41:4130-42 (1998) 
 
GABA-A receptor; alpha-5/beta-3/gamma-2
Name:GABA-A receptor; alpha-5/beta-3/gamma-2
Type:n/a
Mol. Mass.:n/a
Description:ASSAY_ID of ChEMBL is 2148177
Components:This complex has 3 components.
Component 1
Name:Gamma-aminobutyric acid receptor subunit gamma-2
Synonyms:GABA(A) receptor subunit gamma-2 GBRG2_HUMAN
Type:PROTEIN
Mol. Mass.:54172.74
Organism:Homo sapiens (Human)
Description:EBI_217
Residue:467
Component 2
Name:Gamma-aminobutyric acid receptor subunit beta-3
Synonyms:GABA A receptor alpha-4/beta-3/gamma-2 GABA-A receptor GBRB3_HUMAN | agonist GABA site
Type:PROTEIN
Mol. Mass.:54130.51
Organism:Homo sapiens (Human)
Description:ChEMBL_448071
Residue:473
Component 3
Name:Gamma-aminobutyric acid receptor subunit alpha-5
Synonyms:GABA receptor alpha-5 subunit GABRA5 Gamma-aminobutyric acid receptor subunit alpha-5 (GABA(A)) | Gamma-aminobutyric acid receptor subunit alpha-5 (GABAA)
Type:Enzyme
Mol. Mass.:52160.59
Organism:Homo sapiens (Human)
Description:P31644
Residue:462
BDBM50049738
NameBDBM50049738
Synonyms:5-Methyl-6-oxo-8-trimethylsilanylethynyl-5,6-dihydro-4H-2,5,10b-triaza-benzo[e]azulene-3-carboxylic acid ethyl ester | CHEMBL59181
TypeSmall organic molecule
Emp. Form.C20H23N3O3Si
Mol. Mass.381.5004
SMILESCCOC(=O)c1ncn-2c1CN(C)C(=O)c1cc(ccc-21)C#C[Si](C)(C)C