Reaction Details
TargetGamma-aminobutyric acid receptor subunit alpha-6/beta-3/gamma-2
LigandBDBM50049737
Substrate/Competitorn/a
Meas. Tech.ChEMBL_68435 (CHEMBL683047)
Ki 44±n/a nM
Citation Huang, QLiu, RZhang, PHe, XMcKernan, RGan, TBennett, DWCook, JM Predictive models for GABAA/benzodiazepine receptor subtypes: studies of quantitative structure-activity relationships for imidazobenzodiazepines at five recombinant GABAA/benzodiazepine receptor subtypes [alphaxbeta3gamma2 (x = 1-3, 5, and 6)] via comparative molecular field analysis. J Med Chem41:4130-42 (1998) 
 
Gamma-aminobutyric acid receptor subunit alpha-6/beta-3/gamma-2
Name:Gamma-aminobutyric acid receptor subunit alpha-6/beta-3/gamma-2
Type:n/a
Mol. Mass.:n/a
Description:ASSAY_ID of EBI is 68432
Components:This complex has 3 components.
Component 1
Name:Gamma-aminobutyric acid receptor subunit gamma-2
Synonyms:GABA(A) receptor subunit gamma-2 GBRG2_HUMAN
Type:PROTEIN
Mol. Mass.:54172.74
Organism:Homo sapiens (Human)
Description:EBI_217
Residue:467
Component 2
Name:Gamma-aminobutyric acid receptor subunit alpha-6
Synonyms:GABA A alpha6 GABRA6 | GBRA6_HUMAN
Type:Enzyme Catalytic Domain
Mol. Mass.:51029.60
Organism:Homo sapiens (Human)
Description:GABA A alpha6 0 HUMAN::Q16445
Residue:453
Component 3
Name:Gamma-aminobutyric acid receptor subunit beta-3
Synonyms:GABA A receptor alpha-4/beta-3/gamma-2 GABA-A receptor GBRB3_HUMAN | agonist GABA site
Type:PROTEIN
Mol. Mass.:54130.51
Organism:Homo sapiens (Human)
Description:ChEMBL_448071
Residue:473
BDBM50049737
NameBDBM50049737
Synonyms:5-Methyl-6-oxo-8-propa-1,2-dienyl-5,6-dihydro-4H-2,5,10b-triaza-benzo[e]azulene-3-carboxylic acid ethyl ester | CHEMBL57655
TypeSmall organic molecule
Emp. Form.C18H17N3O3
Mol. Mass.323.3459
SMILESCCOC(=O)c1ncn-2c1CN(C)C(=O)c1cc(C=C=C)ccc-21