Reaction Details
TargetGamma-aminobutyric acid receptor subunit alpha-1/beta-3/gamma-2
LigandBDBM50067441
Substrate/Competitorn/a
Meas. Tech.ChEMBL_217133 (CHEMBL822165)
Ki 1.5±n/a nM
Citation Huang, QLiu, RZhang, PHe, XMcKernan, RGan, TBennett, DWCook, JM Predictive models for GABAA/benzodiazepine receptor subtypes: studies of quantitative structure-activity relationships for imidazobenzodiazepines at five recombinant GABAA/benzodiazepine receptor subtypes [alphaxbeta3gamma2 (x = 1-3, 5, and 6)] via comparative molecular field analysis. J Med Chem41:4130-42 (1998) 
 
Gamma-aminobutyric acid receptor subunit alpha-1/beta-3/gamma-2
Name:Gamma-aminobutyric acid receptor subunit alpha-1/beta-3/gamma-2
Type:Protein
Mol. Mass.:n/a
Description:n/a
Components:This complex has 3 components.
Component 1
Name:Gamma-aminobutyric acid receptor subunit alpha-1
Synonyms:Benzodiazepine central GABA A Benzodiazepine liver GABA(A) receptor subunit alpha-1 GABA-A receptor GBRA1_HUMAN TBPS | agonist GABA site
Type:Protein
Mol. Mass.:51817.35
Organism:Homo sapiens (Human)
Description:P14867
Residue:456
Component 2
Name:Gamma-aminobutyric acid receptor subunit beta-3
Synonyms:GABA A receptor alpha-4/beta-3/gamma-2 GABA-A receptor GBRB3_HUMAN | agonist GABA site
Type:PROTEIN
Mol. Mass.:54130.51
Organism:Homo sapiens (Human)
Description:ChEMBL_448071
Residue:473
Component 3
Name:Gamma-aminobutyric acid receptor subunit gamma-2
Synonyms:GABA(A) receptor subunit gamma-2 GBRG2_HUMAN
Type:PROTEIN
Mol. Mass.:54172.74
Organism:Homo sapiens (Human)
Description:EBI_217
Residue:467
BDBM50067441
NameBDBM50067441
Synonyms:8-Hydroxy-5-methyl-6-oxo-5,6-dihydro-4H-2,5,10b-triaza-benzo[e]azulene-3-carboxylic acid tert-butyl ester | CHEMBL130609
TypeSmall organic molecule
Emp. Form.C17H19N3O4
Mol. Mass.329.3505
SMILESCN1Cc2c(ncn2-c2ccc(O)cc2C1=O)C(=O)OC(C)(C)C