Reaction Details
TargetMu-type opioid receptor
LigandBDBM50067446
Substrate/Competitorn/a
Meas. Tech.ChEMBL_145301 (CHEMBL752836)
Ki 21±n/a nM
Citation Thomas, JBZheng, XMascarella, SWRothman, RBDersch, CMPartilla, JSFlippen-Anderson, JLGeorge, CFCantrell, BEZimmerman, DMCarroll, FI N-Substituted 9beta-methyl-5-(3-hydroxyphenyl)morphans are opioid receptor pure antagonists. J Med Chem41:4143-9 (1998) 
 
Mu-type opioid receptor
Name:Mu-type opioid receptor
Type:Enzyme Catalytic Domain
Mol. Mass.:11165.58
Organism:GUINEA PIG
Description:P97266
Residue:98
BDBM50067446
NameBDBM50067446
Synonyms:3-((R)-2,9-Dimethyl-2-aza-bicyclo[3.3.1]non-5-yl)-phenol | CHEMBL133815
TypeSmall organic molecule
Emp. Form.C16H23NO
Mol. Mass.245.3599
SMILESC[C@H]1C2CCCC1(CCN2C)c1cccc(O)c1