Reaction Details
TargetMu-type opioid receptor
LigandBDBM50067447
Substrate/Competitorn/a
Meas. Tech.ChEMBL_145301 (CHEMBL752836)
Ki 0.34±n/a nM
Citation Thomas, JBZheng, XMascarella, SWRothman, RBDersch, CMPartilla, JSFlippen-Anderson, JLGeorge, CFCantrell, BEZimmerman, DMCarroll, FI N-Substituted 9beta-methyl-5-(3-hydroxyphenyl)morphans are opioid receptor pure antagonists. J Med Chem41:4143-9 (1998) 
 
Mu-type opioid receptor
Name:Mu-type opioid receptor
Type:Enzyme Catalytic Domain
Mol. Mass.:11165.58
Organism:GUINEA PIG
Description:P97266
Residue:98
BDBM50067447
NameBDBM50067447
Synonyms:3-((R)-9-Methyl-2-phenethyl-2-aza-bicyclo[3.3.1]non-5-yl)-phenol | CHEMBL334898
TypeSmall organic molecule
Emp. Form.C23H29NO
Mol. Mass.335.4825
SMILESC[C@H]1C2CCCC1(CCN2CCc1ccccc1)c1cccc(O)c1