Reaction Details
TargetTryptase gamma
LigandBDBM50067523
Substrate/Competitorn/a
Meas. Tech.ChEMBL_210825 (CHEMBL811854)
IC50 100000±n/a nM
Citation Gabriel, BStubbs, MTBergner, AHauptmann, JBode, WStürzebecher, JMoroder, L Design of benzamidine-type inhibitors of factor Xa. J Med Chem41:4240-50 (1998) 
 
Tryptase gamma
Name:Tryptase gamma
Type:PROTEIN
Mol. Mass.:33817.52
Organism:Homo sapiens (Human)
Description:ChEMBL_210833
Residue:321
BDBM50067523
NameBDBM50067523
Synonyms:2-[2-(4-Carbamimidoyl-benzenesulfonylamino)-acetylamino]-3-(3-carbamimidoyl-phenyl)-propionic acid | CHEMBL133027
TypeSmall organic molecule
Emp. Form.C19H22N6O5S
Mol. Mass.446.48
SMILESNC(=N)c1ccc(cc1)S(=O)(=O)NCC(=O)NC(Cc1cccc(c1)C(N)=N)C(O)=O