Reaction Details
TargetPlasminogen
LigandBDBM50067526
Substrate/Competitorn/a
Meas. Tech.ChEMBL_155246 (CHEMBL764735)
Ki 57000±n/a nM
Citation Gabriel, BStubbs, MTBergner, AHauptmann, JBode, WStürzebecher, JMoroder, L Design of benzamidine-type inhibitors of factor Xa. J Med Chem41:4240-50 (1998) 
 
Plasminogen
Name:Plasminogen
Type:Enzyme
Mol. Mass.:90579.18
Organism:Homo sapiens (Human)
Description:n/a
Residue:810
BDBM50067526
NameBDBM50067526
Synonyms:2-[2-(4-Carbamimidoyl-benzenesulfonylamino)-acetylamino]-3-(4-carbamimidoyl-phenyl)-propionic acid | CHEMBL341933
TypeSmall organic molecule
Emp. Form.C19H22N6O5S
Mol. Mass.446.48
SMILESNC(=N)c1ccc(CC(NC(=O)CNS(=O)(=O)c2ccc(cc2)C(N)=N)C(O)=O)cc1